{"text_format":"1","workbook":"xlsx","n_sheets":5,"sheets":["Instructions","Summary","Details","OG_TITLE-Short","OG_TITLE-UTS"],"not_rendered":{"charts":5,"images":1,"macros":1,"external_links":0,"defined_names":0,"comments":1,"pivot_tables":0},"unopened":[],"bounds":{"document_bytes":16777216,"sheet_cells":100000,"rows_first":2000,"rows_last":500,"rows_between":2000,"halvings":0,"cell_chars":16384,"cell_head_chars":4096},"cells_cut":0,"cells_raw":0,"read":"whole","date_system":"1900"}

{"sheet":"Instructions","index":0,"n_rows":21,"n_cols":8,"rows_kept":21,"cut":false,"hidden":false,"merged":[[2,1,2,3],[3,1,3,3],[3,4,3,6]]}
[null,{"$f":"IFERROR(MAX(G8:G17),1)","v":554}]
[]
[null,"Domain URL",null,null,"www.break.com"]
[null,"Report Date:",null,null,"2013-08-29"]
[]
[]
[null,null,null,null,null,"Tag Names","URLs Crawled","Include Tag in Client Version"]
[null,null,null,null,1,"OG_TITLE",554,"Yes"]
[null,null,null,null,2,null,null,"Yes"]
[null,null,null,null,3,null,null,"Yes"]
[null,null,null,null,4,null,null,"Yes"]
[null,null,null,null,5,null,null,"Yes"]
[null,null,null,null,6,null,null,"Yes"]
[null,null,null,null,7,null,null,"Yes"]
[null,null,null,null,8,null,null,"Yes"]
[null,null,null,null,9,null,null,"Yes"]
[null,null,null,null,10,null,null,"Yes"]
[]
[null,"Step1: Check the client name and the Report Date. Date automatically saves the date when the file was opened first time."]
[null,"Step2: Check 'Summary' sheet and update 'Include Tag in Client Version' column of above table to 'No' if you don't want to include the Tag in client version."]
[null,"Step3:"]

{"sheet":"Summary","index":1,"n_rows":44,"n_cols":14,"rows_kept":44,"cut":false,"hidden":false,"merged":[[21,2,21,4],[21,6,21,7],[21,9,21,10],[21,12,21,13]]}
[false]
[]
[null,{"$f":"CONCATENATE(\"ADR Lite: \",Instructions!E3)","v":"ADR Lite: www.break.com"}]
[null,"Report Date:",{"$f":"Instructions!E4","v":"2013-08-29"}]
[]
[]
[]
[]
[]
[]
[]
[]
[]
[]
[]
[]
[]
[]
[]
[]
[]
[null,null,"Duplicate Tags Across Site",null,null,null,"Duplicate Tags on Page",null,null,"Multiple Tags on Page",null,null,"Tag Length"]
[null,null,"Unique","Duplicate","Total",null,"Unique","Duplicate",null,"Single","Multiple",null,"Short Tags","Long Tags"]
["No",null,"UTS","DTS",null,null,null,"DTP",null,null,"MTP",null,"Short","Long"]
[{"$f":"IF(B25=\"\",\"No\",\"Yes\")","v":"Yes"},{"$f":"IF(OR(Instructions!F8=\"\",Instructions!H8=\"No\"),\"\",Instructions!F8)","v":"OG_TITLE"},{"$f":"IF(COUNTA(INDIRECT(\"'\"&$B25&\"-\"&C$24&\"'!A:A\"))=1,\"\",COUNTA(INDIRECT(\"'\"&$B25&\"-\"&C$24&\"'!A:A\"))-1)","v":554},{"$f":"IF(COUNTA(INDIRECT(\"'\"&$B25&\"-\"&D$24&\"'!A:A\"))=1,\"\",COUNTA(INDIRECT(\"'\"&$B25&\"-\"&D$24&\"'!A:A\"))-1)","v":""},{"$f":"IF(OR(Instructions!F8=\"\",Instructions!H8=\"No\"),\"\",Instructions!G8)","v":554},null,{"$f":"IF(H25=\"\",E25,E25-H25)","v":554},{"$f":"IF(COUNTA(INDIRECT(\"'\"&$B25&\"-\"&H$24&\"'!A:A\"))=1,\"\",COUNTA(INDIRECT(\"'\"&$B25&\"-\"&H$24&\"'!A:A\"))-1)","v":""},null,{"$f":"IF(K25=\"\",E25,E25-K25)","v":554},{"$f":"IF(COUNTA(INDIRECT(\"'\"&$B25&\"-\"&K$24&\"'!A:A\"))=1,\"\",COUNTA(INDIRECT(\"'\"&$B25&\"-\"&K$24&\"'!A:A\"))-1)","v":""},null,{"$f":"IF(COUNTA(INDIRECT(\"'\"&$B25&\"-\"&M$24&\"'!A:A\"))=1,\"\",COUNTA(INDIRECT(\"'\"&$B25&\"-\"&M$24&\"'!A:A\"))-1)","v":67},{"$f":"IF(COUNTA(INDIRECT(\"'\"&$B25&\"-\"&N$24&\"'!A:A\"))=1,\"\",COUNTA(INDIRECT(\"'\"&$B25&\"-\"&N$24&\"'!A:A\"))-1)","v":""}]
[{"$f":"IF(B26=\"\",\"No\",\"Yes\")","v":"No"},{"$f":"IF(OR(Instructions!F9=\"\",Instructions!H9=\"No\"),\"\",Instructions!F9)","v":""},{"$f":"IF(COUNTA(INDIRECT(\"'\"&$B26&\"-\"&C$24&\"'!A:A\"))=1,\"\",COUNTA(INDIRECT(\"'\"&$B26&\"-\"&C$24&\"'!A:A\"))-1)","v":""},"",{"$f":"IF(OR(Instructions!F9=\"\",Instructions!H9=\"No\"),\"\",Instructions!G9)","v":""},null,{"$f":"IF(H26=\"\",E26,E26-H26)","v":""},{"$f":"IF(COUNTA(INDIRECT(\"'\"&$B26&\"-\"&H$24&\"'!A:A\"))=1,\"\",COUNTA(INDIRECT(\"'\"&$B26&\"-\"&H$24&\"'!A:A\"))-1)","v":""},null,{"$f":"IF(K26=\"\",E26,E26-K26)","v":""},{"$f":"IF(COUNTA(INDIRECT(\"'\"&$B26&\"-\"&K$24&\"'!A:A\"))=1,\"\",COUNTA(INDIRECT(\"'\"&$B26&\"-\"&K$24&\"'!A:A\"))-1)","v":""},null,{"$f":"IF(COUNTA(INDIRECT(\"'\"&$B26&\"-\"&M$24&\"'!A:A\"))=1,\"\",COUNTA(INDIRECT(\"'\"&$B26&\"-\"&M$24&\"'!A:A\"))-1)","v":""},""]
["No",{"$f":"IF(OR(Instructions!F10=\"\",Instructions!H10=\"No\"),\"\",Instructions!F10)","v":""},"","",{"$f":"IF(OR(Instructions!F10=\"\",Instructions!H10=\"No\"),\"\",Instructions!G10)","v":""},null,"","",null,"","",null,"",""]
["No",{"$f":"IF(OR(Instructions!F11=\"\",Instructions!H11=\"No\"),\"\",Instructions!F11)","v":""},"","",{"$f":"IF(OR(Instructions!F11=\"\",Instructions!H11=\"No\"),\"\",Instructions!G11)","v":""},null,"","",null,"","",null,"",""]
["No",{"$f":"IF(OR(Instructions!F12=\"\",Instructions!H12=\"No\"),\"\",Instructions!F12)","v":""},"","",{"$f":"IF(OR(Instructions!F12=\"\",Instructions!H12=\"No\"),\"\",Instructions!G12)","v":""},null,"","",null,"","",null,"",""]
["No",{"$f":"IF(OR(Instructions!F13=\"\",Instructions!H13=\"No\"),\"\",Instructions!F13)","v":""},"","",{"$f":"IF(OR(Instructions!F13=\"\",Instructions!H13=\"No\"),\"\",Instructions!G13)","v":""},null,"","",null,"","",null,"",""]
["No",{"$f":"IF(OR(Instructions!F14=\"\",Instructions!H14=\"No\"),\"\",Instructions!F14)","v":""},"","",{"$f":"IF(OR(Instructions!F14=\"\",Instructions!H14=\"No\"),\"\",Instructions!G14)","v":""},null,"","",null,"","",null,"",""]
["No",{"$f":"IF(OR(Instructions!F15=\"\",Instructions!H15=\"No\"),\"\",Instructions!F15)","v":""},"","",{"$f":"IF(OR(Instructions!F15=\"\",Instructions!H15=\"No\"),\"\",Instructions!G15)","v":""},null,"","",null,"","",null,"",""]
["No",{"$f":"IF(OR(Instructions!F16=\"\",Instructions!H16=\"No\"),\"\",Instructions!F16)","v":""},"","",{"$f":"IF(OR(Instructions!F16=\"\",Instructions!H16=\"No\"),\"\",Instructions!G16)","v":""},null,"","",null,"","",null,"",""]
["No",{"$f":"IF(OR(Instructions!F17=\"\",Instructions!H17=\"No\"),\"\",Instructions!F17)","v":""},"","",{"$f":"IF(OR(Instructions!F17=\"\",Instructions!H17=\"No\"),\"\",Instructions!G17)","v":""},null,"","",null,"","",null,"",""]
["No",{"$f":"IF(OR(Instructions!F18=\"\",Instructions!H18=\"No\"),\"\",Instructions!F18)","v":""},"","",{"$f":"IF(OR(Instructions!F18=\"\",Instructions!H18=\"No\"),\"\",Instructions!G18)","v":""},null,"","",null,"","",null,"",""]
["No",{"$f":"IF(OR(Instructions!F19=\"\",Instructions!H19=\"No\"),\"\",Instructions!F19)","v":""},"","",{"$f":"IF(OR(Instructions!F19=\"\",Instructions!H19=\"No\"),\"\",Instructions!G19)","v":""},null,"","",null,"","",null,"",""]
["No",{"$f":"IF(OR(Instructions!F20=\"\",Instructions!H20=\"No\"),\"\",Instructions!F20)","v":""},"","",{"$f":"IF(OR(Instructions!F20=\"\",Instructions!H20=\"No\"),\"\",Instructions!G20)","v":""},null,"","",null,"","",null,"",""]
["No",{"$f":"IF(OR(Instructions!F21=\"\",Instructions!H21=\"No\"),\"\",Instructions!F21)","v":""},"","",{"$f":"IF(OR(Instructions!F21=\"\",Instructions!H21=\"No\"),\"\",Instructions!G21)","v":""},null,"","",null,"","",null,"",""]
["No",{"$f":"IF(OR(Instructions!F22=\"\",Instructions!H22=\"No\"),\"\",Instructions!F22)","v":""},"","",{"$f":"IF(OR(Instructions!F22=\"\",Instructions!H22=\"No\"),\"\",Instructions!G22)","v":""},null,"","",null,"","",null,"",""]
["No",{"$f":"IF(OR(Instructions!F23=\"\",Instructions!H23=\"No\"),\"\",Instructions!F23)","v":""},"","",{"$f":"IF(OR(Instructions!F23=\"\",Instructions!H23=\"No\"),\"\",Instructions!G23)","v":""},null,"","",null,"","",null,"",""]
{"$rows_left_out":5}
{"sheet":"Details","index":2,"n_rows":565,"n_cols":34,"rows_kept":565,"cut":false,"hidden":false,"merged":[[18,25,18,28],[11,25,11,28],[12,25,12,28],[13,25,13,28],[14,25,14,28],[15,25,15,28],[10,25,10,28],[8,25,8,28],[9,25,9,28],[16,25,16,28],[17,25,17,28]]}
[]
[]
[null,null,{"$f":"Summary!B3","v":"ADR Lite: www.break.com"}]
[]
[null,null,null,{"$f":"IF(D7<>\"MTP\",\"\",IF(MAX(E:E)>1,\"Diplicate Tags present on Page\",\"\"))","v":""}]
[2,null,"Tag Name",{"$f":"VLOOKUP(A6,P10:Q19,2,0)","v":""}]
[1,null,"Issue Type",{"$f":"VLOOKUP(A7,S10:U19,3,0)","v":""}]
[null,null,{"$f":"IF(C9=\"Tag Content\",\"C\",\"A\")","v":"A"},{"$f":"IF(D9=\"Tag Content\",\"C\",\"A\")","v":"C"},{"$f":"IF(E9=\"\",\"\",\"D\")","v":""}]
[1,null,{"$f":"IF(AND(D7<>\"DTS\",D7<>\"DTP\"),\"Source URL\",\"Tag Content\")","v":"Source URL"},{"$f":"IF(AND(D7<>\"DTS\",D7<>\"DTP\"),\"Tag Content\",\"Source URL\")","v":"Tag Content"},{"$f":"IF(OR(D7=\"long\",D7=\"short\"),\"Character Count\",IF(OR(D7=\"DTS\",D7=\"MTS\",D7=\"DTP\"),\"Instance Count\",\"\"))","v":""},null,null,null,null,null,null,null,null,null,null,null,"Tag Name",null,null,"Issue Type","Sheet Key",null,null,"Issue Types","Sheet Name Key","Sorting"]
[{"$f":"A9+1","v":2},null,{"$f":"IFERROR(INDIRECT(\"'\"&D$6&\"-\"&D$7&\"'!\"&C$8&$A10),\"\")","v":""},{"$f":"IFERROR(INDIRECT(\"'\"&D$6&\"-\"&D$7&\"'!\"&D$8&$A10),\"\")","v":""},{"$f":"IFERROR(INDIRECT(\"'\"&D$6&\"-\"&D$7&\"'!\"&E$8&$A10),\"\")","v":""},null,null,null,null,null,null,null,null,null,null,1,{"$f":"IF(Instructions!F8=\"\",\"\",IF(Instructions!H8=\"Yes\",Instructions!F8,\"\"))","v":"OG_TITLE"},null,1,{"$f":"IF(IFERROR(VLOOKUP(VLOOKUP($A$6,$P$9:$Q$19,2,0),$X$22:$AH$32,S10+1,0),\"\")=\"\",\"\",VLOOKUP(VLOOKUP($A$6,$P$9:$Q$19,2,0),$X$22:$AH$32,S10+1,0))","v":""},{"$f":"IFERROR(VLOOKUP(T10,$X$10:$Y$19,2,0),\"\")","v":""},null,1,"Duplicate Tags across site","DTS","Count Number of duplicate tags and sort by decending count then by Tag then URL"]
[{"$f":"A10+1","v":3},null,{"$f":"IFERROR(INDIRECT(\"'\"&D$6&\"-\"&D$7&\"'!\"&C$8&$A11),\"\")","v":""},{"$f":"IFERROR(INDIRECT(\"'\"&D$6&\"-\"&D$7&\"'!\"&D$8&$A11),\"\")","v":""},{"$f":"IFERROR(INDIRECT(\"'\"&D$6&\"-\"&D$7&\"'!\"&E$8&$A11),\"\")","v":""},null,null,null,null,null,null,null,null,null,null,2,{"$f":"IF(Instructions!F9=\"\",\"\",IF(Instructions!H9=\"Yes\",Instructions!F9,\"\"))","v":""},null,2,"",{"$f":"IFERROR(VLOOKUP(T11,$X$10:$Y$19,2,0),\"\")","v":""},null,2,"Unique Tags across Site","UTS","By URL"]
[4,null,{"$f":"IFERROR(INDIRECT(\"'\"&D$6&\"-\"&D$7&\"'!\"&C$8&$A12),\"\")","v":""},"",{"$f":"IFERROR(INDIRECT(\"'\"&D$6&\"-\"&D$7&\"'!\"&E$8&$A12),\"\")","v":""},null,null,null,null,null,null,null,null,null,null,3,{"$f":"IF(Instructions!F10=\"\",\"\",IF(Instructions!H10=\"Yes\",Instructions!F10,\"\"))","v":""},null,3,"","",null,3,"Multiple Tags on Page","MTP","Count Number of tags per URL and sort by decending count then by URL"]
[5,null,"","","",null,null,null,null,null,null,null,null,null,null,4,{"$f":"IF(Instructions!F11=\"\",\"\",IF(Instructions!H11=\"Yes\",Instructions!F11,\"\"))","v":""},null,4,"","",null,4,"Duplicate Tags on Page","DTP","Count Number of tags per URL and sort by decending count then by URL"]
[6,null,"","","",null,null,null,null,null,null,null,null,null,null,5,{"$f":"IF(Instructions!F12=\"\",\"\",IF(Instructions!H12=\"Yes\",Instructions!F12,\"\"))","v":""},null,5,"","",null,5,"Short Tags","Short","Increasing length and then by Tags"]
[7,null,"","","",null,null,null,null,null,null,null,null,null,null,6,{"$f":"IF(Instructions!F13=\"\",\"\",IF(Instructions!H13=\"Yes\",Instructions!F13,\"\"))","v":""},null,6,"","",null,6,"Long Tags","Long","Decreasing Length and then by Tags"]
[8,null,"","","",null,null,null,null,null,null,null,null,null,null,7,{"$f":"IF(Instructions!F14=\"\",\"\",IF(Instructions!H14=\"Yes\",Instructions!F14,\"\"))","v":""},null,7,"","",null,7,"Profanity","Profanity"]
[9,null,"","","",null,null,null,null,null,null,null,null,null,null,8,{"$f":"IF(Instructions!F15=\"\",\"\",IF(Instructions!H15=\"Yes\",Instructions!F15,\"\"))","v":""},null,8,"","",null,8]
[10,null,"","","",null,null,null,null,null,null,null,null,null,null,9,{"$f":"IF(Instructions!F16=\"\",\"\",IF(Instructions!H16=\"Yes\",Instructions!F16,\"\"))","v":""},null,9,"","",null,9]
[11,null,"","","",null,null,null,null,null,null,null,null,null,null,10,{"$f":"IF(Instructions!F17=\"\",\"\",IF(Instructions!H17=\"Yes\",Instructions!F17,\"\"))","v":""},null,10,"","",null,10]
[12,null,"","",""]
[13,null,"","",""]
[14,null,"","","",null,null,null,null,null,null,null,null,null,null,null,null,null,null,null,null,null,null,"Tag Name",1,2,3,4,5,6,7,8,9,10]
[15,null,"","","",null,null,null,null,null,null,null,null,null,null,null,null,null,null,null,null,null,1,"CANONICAL","Duplicate Tags across site","Unique Tags across Site","Multiple Tags on Page","Duplicate Tags on Page"]
[16,null,"","","",null,null,null,null,null,null,null,null,null,null,null,null,null,null,null,null,null,2,"OG_TITLE","Duplicate Tags across site","Unique Tags across Site","Multiple Tags on Page","Duplicate Tags on Page","Short Tags","Long Tags"]
[17,null,"","","",null,null,null,null,null,null,null,null,null,null,null,null,null,null,null,null,null,3,"OG_TYPE","Duplicate Tags across site","Unique Tags across Site","Multiple Tags on Page","Duplicate Tags on Page"]
[18,null,"","","",null,null,null,null,null,null,null,null,null,null,null,null,null,null,null,null,null,4,"OG_URL","Duplicate Tags across site","Unique Tags across Site","Multiple Tags on Page","Duplicate Tags on Page","Short Tags","Long Tags"]
[19,null,"","","",null,null,null,null,null,null,null,null,null,null,null,null,null,null,null,null,null,5,"OG_IMG","Duplicate Tags across site","Unique Tags across Site","Multiple Tags on Page","Duplicate Tags on Page"]
[20,null,"","","",null,null,null,null,null,null,null,null,null,null,null,null,null,null,null,null,null,6,""]
[21,null,"","","",null,null,null,null,null,null,null,null,null,null,null,null,null,null,null,null,null,7,""]
[22,null,"","","",null,null,null,null,null,null,null,null,null,null,null,null,null,null,null,null,null,8,""]
[23,null,"","","",null,null,null,null,null,null,null,null,null,null,null,null,null,null,null,null,null,9,""]
[24,null,"","","",null,null,null,null,null,null,null,null,null,null,null,null,null,null,null,null,null,10,""]
[25,null,"","",""]
[26,null,"","","",null,null,null,null,null,null,null,null,null,null,null,null,null,null,null,null,null,null,"Sheet Name",1,2,3,4,5,6,7,8,9,10]
[27,null,"","","",null,null,null,null,null,null,null,null,null,null,null,null,null,null,null,null,null,1,{"$f":"X23","v":"CANONICAL"},{"$f":"IF(OR($X35=\"\",Y23=\"\"),\"\",CONCATENATE($X35,\"-\",IFERROR(VLOOKUP(Y23,$X$10:$Y$19,2,0),\"\")))","v":"CANONICAL-DTS"},{"$f":"IF(OR($X35=\"\",Z23=\"\"),\"\",CONCATENATE($X35,\"-\",IFERROR(VLOOKUP(Z23,$X$10:$Y$19,2,0),\"\")))","v":"CANONICAL-UTS"},"CANONICAL-MTP","CANONICAL-DTP","","","","","",""]
[28,null,"","","",null,null,null,null,null,null,null,null,null,null,null,null,null,null,null,null,null,2,{"$f":"X24","v":"OG_TITLE"},{"$f":"IF(OR($X36=\"\",Y24=\"\"),\"\",CONCATENATE($X36,\"-\",IFERROR(VLOOKUP(Y24,$X$10:$Y$19,2,0),\"\")))","v":"OG_TITLE-DTS"},"OG_TITLE-UTS","OG_TITLE-MTP","OG_TITLE-DTP","OG_TITLE-Short","OG_TITLE-Long","","","",""]
[29,null,"","","",null,null,null,null,null,null,null,null,null,null,null,null,null,null,null,null,null,3,"OG_TYPE","OG_TYPE-DTS","OG_TYPE-UTS","OG_TYPE-MTP","OG_TYPE-DTP","","","","","",""]
[30,null,"","","",null,null,null,null,null,null,null,null,null,null,null,null,null,null,null,null,null,4,"OG_URL","OG_URL-DTS","OG_URL-UTS","OG_URL-MTP","OG_URL-DTP","OG_URL-Short","OG_URL-Long","","","",""]
[31,null,"","","",null,null,null,null,null,null,null,null,null,null,null,null,null,null,null,null,null,5,"OG_IMG","OG_IMG-DTS","OG_IMG-UTS","OG_IMG-MTP","OG_IMG-DTP","","","","","",""]
[32,null,"","","",null,null,null,null,null,null,null,null,null,null,null,null,null,null,null,null,null,6,"","","","","","","","","","",""]
{"$rows_left_out":526}
{"sheet":"OG_TITLE-Short","index":3,"n_rows":68,"n_cols":4,"rows_kept":68,"cut":false,"hidden":false,"merged":[]}
["URL","TagName","TagContent","SortingCount"]
["http://www.break.com/video/bus-crashes-67255","OG_TITLE","Bus Crashes",11]
["http://www.break.com/video/dog-for-dog-2501518","OG_TITLE","Dog for Dog",11]
["http://www.break.com/video/ghetto-air-67232","OG_TITLE","Ghetto Air",11]
["http://www.break.com/video/dog-vs-steps-2497837","OG_TITLE","Dog Vs Steps",12]
["http://www.break.com/video/man-vs-moose-2051504","OG_TITLE","Man Vs Moose",12]
["http://www.break.com/video/tears-of-joy-2493312","OG_TITLE","Tears Of Joy",12]
["http://www.break.com/video/the-trainer-1902223","OG_TITLE","The Trainer",12]
["http://www.break.com/video/2-girls-1-cup-395089","OG_TITLE","2 Girls 1 Cup",13]
["http://www.break.com/video/dog-door-fail-2327600","OG_TITLE","Dog Door Fail",13]
["http://www.break.com/video/hottie-beaver-670428","OG_TITLE","Hottie Beaver",13]
["http://www.break.com/video/cry-me-a-river-155440","OG_TITLE","Cry Me A River",14]
["http://www.break.com/video/post-it-mario-2351387","OG_TITLE","Post-it Mario",14]
["http://www.break.com/video/sheep-protest-2506795","OG_TITLE","Sheep Protest!",14]
["http://www.break.com/video/40-foot-shark-2298461","OG_TITLE","40 FOOT SHARK!",15]
["http://www.break.com/video/bridgesplosion-2425321","OG_TITLE","Bridgesplosion!",15]
["http://www.break.com/video/cat-machine-gun-1849224","OG_TITLE","Cat Machine Gun",15]
["http://www.break.com/video/cat-mimics-yawn-2506057","OG_TITLE","Cat Mimics Yawn",15]
["http://www.break.com/video/mirrors-trailer-545265","OG_TITLE","Mirrors Trailer",15]
["http://www.break.com/video/smell-my-finger-1422738","OG_TITLE","Smell My Finger",15]
["http://www.break.com/video/stupid-reporter-2062168","OG_TITLE","Stupid Reporter",15]
["http://www.break.com/video/cute-lazy-ferret-2436793","OG_TITLE","Cute lazy ferret",16]
["http://www.break.com/video/epic-snail-fail-2446193","OG_TITLE","Epic snail fail!",16]
["http://www.break.com/video/frankenstein-cat-2089909","OG_TITLE","Frankenstein Cat",16]
["http://www.break.com/video/paws-on-the-wall-2501290","OG_TITLE","Paws On The Wall",16]
["http://www.break.com/video/ugc/big-football-hit-345164","OG_TITLE","Big Football HIT",16]
["http://www.break.com/video/ugc/football-big-hit-348369","OG_TITLE","football big hit",16]
["http://www.break.com/video/ugc/miley-cyrus-dead-640665","OG_TITLE","Miley Cyrus Dead",16]
["http://www.break.com/video/ugc/nfl-hardest-hits-1680048","OG_TITLE","NFL HARDEST HITS",16]
["http://www.break.com/video/brutal-ski-injury-696554","OG_TITLE","Brutal Ski Injury",17]
["http://www.break.com/video/hot-chick-pranked-608700","OG_TITLE","Hot Chick Pranked",17]
["http://www.break.com/video/so-god-made-a-dog-2489985","OG_TITLE","So God Made A Dog",17]
["http://www.break.com/video/waterslide-stunts-447072","OG_TITLE","Waterslide Stunts",17]
["http://www.break.com/video/45-cute-dog-tricks-2495883","OG_TITLE","45 Cute Dog Tricks",18]
["http://www.break.com/video/best-cosplay-ever-2323721","OG_TITLE","Best Cosplay Ever?",18]
["http://www.break.com/video/cool-science-trick-2094166","OG_TITLE","Cool Science Trick",18]
["http://www.break.com/video/gta-4-carmageddon-1983889","OG_TITLE","GTA 4 Carmageddon!",18]
["http://www.break.com/video/insane-flexibility-863579","OG_TITLE","Insane Flexibility",18]
["http://www.break.com/video/no-pants-yes-beer-565219","OG_TITLE","No Pants, Yes Beer",18]
["http://www.break.com/video/people-are-awesome-1942501","OG_TITLE","People Are Awesome",18]
{"$rows_left_out":29}
{"sheet":"OG_TITLE-UTS","index":4,"n_rows":555,"n_cols":4,"rows_kept":555,"cut":false,"hidden":false,"merged":[]}
["URL","TagName","TagContent","SortingCount"]
["http://www.break.com/apps/","OG_TITLE","Apps | Plug-Ins | Widgets | Multi-Media Channels by Break.com",61]
["http://www.break.com/article/7-trainwreck-teen-stars-2510952","OG_TITLE","7 Trainwreck Teen Stars | Break.com",35]
["http://www.break.com/article/discuss-ben-affleck-is-the-new-batman-2508991","OG_TITLE","DISCUSS: Ben Affleck Is The New Batman | Break.com",50]
["http://www.break.com/article/kid-loses-out-on-date-with-kate-upton-gets-different-model-2446932","OG_TITLE","Lucky Kid Loses Upton As Prom Date, Gets Different Model | Break.com",68]
["http://www.break.com/article/miley-cyrus-performs-at-the-vmas-tries-too-hard-is-gross-2509950","OG_TITLE","Miley Cyrus Performs At The VMAs, Tries Too Hard, Is Gross | Break.com",70]
["http://www.break.com/article/sexy-video-of-female-israeli-soldiers-dancing-has-leaked-2461014","OG_TITLE","Sexy Video Of Female Israeli Soldiers Dancing Has Leaked | Break.com",68]
["http://www.break.com/article/the-daily-wrap-august-27th-2510840","OG_TITLE","The Daily Wrap: August 27th | Break.com",39]
["http://www.break.com/article/tlc-developing-show-about-this-guys-huge-nutsack-2500404","OG_TITLE","TLC Developing Show About This Guy's Huge Nutsack | Break.com",61]
["http://www.break.com/pictures/10-reasons-you-should-go-rock-climbing-2361169","OG_TITLE","10 Reasons You Should Go Rock Climbing | Rock Climbing: Hanging Out",67]
["http://www.break.com/pictures/12-awesome-military-machine-concepts-2432823","OG_TITLE","12 Awesome Military Machine Concepts | Military Machines: Howitzer",66]
["http://www.break.com/pictures/15-of-the-funniest-reactions-to-ben-affleck-as-batman-2509186","OG_TITLE","15 Of The Funniest Reactions To Ben Affleck As Batman | Batfleck: Filmdrunk",75]
["http://www.break.com/pictures/20-gangsta-dogs-1955633","OG_TITLE","20 Gangsta Dogs | Cash Money Dogg",33]
["http://www.break.com/pictures/break-picture-gallery-august-30th-2012-edition-2364019","OG_TITLE","Break Picture Gallery: August 30th, 2012 Edition | Man vs Jaws",62]
["http://www.break.com/pictures/break-picture-gallery-july-10th-2012-edition-2343796","OG_TITLE","Break Picture Gallery: July 10th, 2012 Edition | Vertical Planker",65]
["http://www.break.com/pictures/break-picture-gallery-may-9th-2012-edition-2325332","OG_TITLE","Break Picture Gallery: May 9th, 2012 Edition | Come at me, bro",62]
["http://www.break.com/pictures/dandg-4-at-the-club-2510452","OG_TITLE","Dogs And Women #4 | D&G 4: At The Club",38]
["http://www.break.com/pictures/dandg-4-duck-face-we-can-forgive-2510450","OG_TITLE","Dogs And Women #4 | D&G 4: Duck Face We Can Forgive",51]
["http://www.break.com/pictures/dandg-4-enjoying-the-air-2510441","OG_TITLE","Dogs And Women #4 | D&G 4: Enjoying The Air",43]
["http://www.break.com/pictures/dandg-4-getting-a-drink-2510454","OG_TITLE","Dogs And Women #4 | D&G 4: Getting A Drink",42]
["http://www.break.com/pictures/dandg-4-lots-to-hold-in-2510464","OG_TITLE","Dogs And Women #4 | D&G 4: Lots To Hold In",42]
["http://www.break.com/pictures/dandg-4-need-help-2510459","OG_TITLE","Dogs And Women #4 | D&G 4: Need Help?",37]
["http://www.break.com/pictures/dandg-4-office-worker-2510447","OG_TITLE","Dogs And Women #4 | D&G 4: Office Worker",40]
["http://www.break.com/pictures/dandg-4-party-gals-2510446","OG_TITLE","Dogs And Women #4 | D&G 4: Party Gals",37]
["http://www.break.com/pictures/dandg-4-punk-girl-2510458","OG_TITLE","Dogs And Women #4 | D&G 4: Punk Girl",36]
["http://www.break.com/pictures/dandg-4-skater-girl-2510448","OG_TITLE","Dogs And Women #4 | D&G 4: Skater Girl",38]
["http://www.break.com/pictures/dandg-4-tats-2510440","OG_TITLE","Dogs And Women #4 | D&G 4: Tats",31]
["http://www.break.com/pictures/dandg-4-tie-2510462","OG_TITLE","Dogs And Women #4 | D&G 4: Tie",30]
["http://www.break.com/pictures/dogs-and-women-4-2510434","OG_TITLE","Dogs And Women #4 | D&G 4: Big Baby",35]
["http://www.break.com/pictures/just-wtf-is-going-on-here-2510386","OG_TITLE","Just WTF Is Going On Here? | WTF: Big Bugs",42]
["http://www.break.com/pictures/ladies-stretching-is-a-good-thing-2368759","OG_TITLE","Ladies Stretching Is A Good Thing | Stretching: Ouch",52]
["http://www.break.com/pictures/people-who-make-all-humans-look-bad-2350576","OG_TITLE","People Who Make All Humans Look Bad | Humans Look Bad: Computer Problems",72]
["http://www.break.com/pictures/pics-of-82713-advertised-as-is-2510559","OG_TITLE","The Most Amazing Pics Of 8.27.13! | Pics Of 8.27.13: Advertised As Is",69]
["http://www.break.com/pictures/pics-of-82713-bad-jump-2510531","OG_TITLE","The Most Amazing Pics Of 8.27.13! | Pics Of 8.27.13: Bad Jump",61]
["http://www.break.com/pictures/pics-of-82713-bear-rafting-2510528","OG_TITLE","The Most Amazing Pics Of 8.27.13! | Pics Of 8.27.13: Bear Rafting",65]
["http://www.break.com/pictures/pics-of-82713-competiting-signs-2510561","OG_TITLE","The Most Amazing Pics Of 8.27.13! | Pics Of 8.27.13: Competiting Signs",70]
["http://www.break.com/pictures/pics-of-82713-granny-cage-2510540","OG_TITLE","The Most Amazing Pics Of 8.27.13! | Pics Of 8.27.13: Granny Cage",64]
["http://www.break.com/pictures/pics-of-82713-hell-help-2510536","OG_TITLE","The Most Amazing Pics Of 8.27.13! | Pics Of 8.27.13: He'll Help",63]
["http://www.break.com/pictures/pics-of-82713-horse-lick-2510537","OG_TITLE","The Most Amazing Pics Of 8.27.13! | Pics Of 8.27.13: Horse Lick",63]
["http://www.break.com/pictures/pics-of-82713-horse-working-the-pole-2510530","OG_TITLE","The Most Amazing Pics Of 8.27.13! | Pics Of 8.27.13: Horse Working The Pole",75]
{"$rows_left_out":515}